Kategoriler
Yazılım

Flutter Gradle Hatası Çözümü

Bu hatanın sebebi Flutter uygulamaları geliştirirken kullandığımız packageların yazılırken gradle ve flutter sürümlerinin değişiklik göstermesinden kaynaklıdır.

Run with –stacktrace option to get the stack trace. Run with –info or –debug option to get more log output. Run with –scan to get full insights.
Get more help at https://help.gradle.org
Exception: Gradle task assembleDebug failed with exit code 1

Merhaba değerli okurlar;

Bu hatanın sebebi Flutter uygulamaları geliştirirken kullandığımız packageların yazılırken gradle ve flutter sürümlerinin değişiklik göstermesinden kaynaklıdır.

Çözümü ise çok basit asılında…

FAILURE: Build failed with an exception.
What went wrong:
Could not receive a message from the daemon.
Try:
Run with –stacktrace option to get the stack trace. Run with –info or –debug option to get more log output. Run with –scan to get full insights.
Get more help at https://help.gradle.org
Exception: Gradle task assembleDebug failed with exit code 1

Run with –stacktrace option to get the stack trace. Run with –info or –debug option to get more log output. Run with –scan to get full insights. hatasını çözümü

İlk olarak bilgisayarım C:\Users\Mehmet ALBAYRAM.gradle\caches dosya yolunda caches içerisinde bulundan tüm dosyaları silip bilgisayarımızı yeniden başlatmamız yeterli olacaktır.

Hatayla ilgili eğer çözüme ulaşmazsanız lütfen yorumlarda bunu bize iletin.

Okuduğunuz için teşekkürler.

Bir Cevap Yazın